Need help in deploying the site

I need advice to debug deploy https://app.netlify.com/sites/upbeat-poincare-f7c75b/deploys/5ffb9bf6fce2f3f5d5e9382b

The linked deploy log is private. Kindly make it publicly visible or paste the text here.

here is the error block:

4:30:41 PM: ────────────────────────────────────────────────────────────────
4:30:41 PM:   1. Build command from Netlify app                             
4:30:41 PM: ────────────────────────────────────────────────────────────────
4:30:41 PM: ​
4:30:41 PM: $ npm run build
4:30:41 PM: > webecheckin@0.1.0 build /opt/build/repo
4:30:41 PM: > react-scripts build
4:30:43 PM: Creating an optimized production build...
4:31:17 PM: 
4:31:17 PM: Treating warnings as errors because process.env.CI = true.
4:31:17 PM: Most CI servers set it automatically.
4:31:17 PM: 
4:31:17 PM: Failed to compile.
4:31:17 PM: 
4:31:17 PM: src/App.js
4:31:17 PM:   Line 4:10:  'Container' is defined but never used             no-unused-vars
4:31:17 PM:   Line 6:50:  'Link' is defined but never used                  no-unused-vars
4:31:17 PM:   Line 7:8:   'createBrowserHistory' is defined but never used  no-unused-vars
4:31:17 PM: src/Components/Home/Carasoul.js
4:31:17 PM:   Line 3:21:   'Row' is defined but never used                                                                            no-unused-vars
4:31:17 PM:   Line 3:26:   'Col' is defined but never used                                                                            no-unused-vars
4:31:17 PM:   Line 6:8:    'strategy_1' is defined but never used                                                                     no-unused-vars
4:31:17 PM:   Line 7:8:    'strategy_2' is defined but never used                                                                     no-unused-vars
4:31:17 PM:   Line 8:8:    'strategy_3' is defined but never used                                                                     no-unused-vars
4:31:17 PM:   Line 9:8:    'strategy_4' is defined but never used                                                                     no-unused-vars
4:31:17 PM:   Line 13:8:   'logo4' is defined but never used                                                                          no-unused-vars
4:31:17 PM:   Line 71:49:  img elements must have an alt prop, either with meaningful text, or an empty string for decorative images  jsx-a11y/alt-text
4:31:17 PM:   Line 72:49:  img elements must have an alt prop, either with meaningful text, or an empty string for decorative images  jsx-a11y/alt-text
4:31:17 PM:   Line 73:49:  img elements must have an alt prop, either with meaningful text, or an empty string for decorative images  jsx-a11y/alt-text
4:31:17 PM: src/Components/Home/Cards.js
4:31:17 PM:   Line 2:16:  'Button' is defined but never used  no-unused-vars
4:31:17 PM: src/Components/Home/Footer.js
4:31:17 PM:   Line 5:10:   'IoLocationSharp' is defined but never used                                                                                                                                                                                                                                                                                                                              no-unused-vars
4:31:17 PM:   Line 5:27:   'IoCall' is defined but never used                                                                                                                                                                                                                                                                                                                                       no-unused-vars
4:31:17 PM:   Line 46:57:  The href attribute is required for an anchor to be keyboard accessible. Provide a valid, navigable address as the href value. If you cannot provide an href, but still need the element to resemble a link, use a button and change it with appropriate styles. Learn more: https://github.com/evcohen/eslint-plugin-jsx-a11y/blob/master/docs/rules/anchor-is-valid.md  jsx-a11y/anchor-is-valid
4:31:17 PM: src/Components/Home/Header.js
4:31:17 PM:   Line 5:27:  'Router' is defined but never used  no-unused-vars
4:31:17 PM:   Line 5:35:  'Switch' is defined but never used  no-unused-vars
4:31:17 PM:   Line 5:43:  'Route' is defined but never used   no-unused-vars
4:31:17 PM: src/Components/Home/Navbar.js
4:31:17 PM:   Line 1:17:  'useEffect' is defined but never used  no-unused-vars
4:31:17 PM:   Line 2:10:  'Container' is defined but never used  no-unused-vars
4:31:17 PM:   Line 2:44:  'Button' is defined but never used     no-unused-vars
4:31:17 PM: src/Components/Home/ServicesSection.js
4:31:17 PM:   Line 4:8:    'services_section_bg' is defined but never used                                                            no-unused-vars
4:31:17 PM:   Line 31:21:  img elements must have an alt prop, either with meaningful text, or an empty string for decorative images  jsx-a11y/alt-text
4:31:17 PM:   Line 36:7:   img elements must have an alt prop, either with meaningful text, or an empty string for decorative images  jsx-a11y/alt-text
4:31:17 PM: src/Components/Home/StrategySection.js
4:31:17 PM:   Line 8:8:    'strategy_section_bg' is defined but never used                                                            no-unused-vars
4:31:17 PM:   Line 19:29:  img elements must have an alt prop, either with meaningful text, or an empty string for decorative images  jsx-a11y/alt-text
4:31:17 PM:   Line 29:29:  img elements must have an alt prop, either with meaningful text, or an empty string for decorative images  jsx-a11y/alt-text
4:31:17 PM:   Line 39:29:  img elements must have an alt prop, either with meaningful text, or an empty string for decorative images  jsx-a11y/alt-text
4:31:17 PM:   Line 49:29:  img elements must have an alt prop, either with meaningful text, or an empty string for decorative images  jsx-a11y/alt-text
4:31:17 PM: src/Components/HowItWorks/SecNavbar.js
4:31:17 PM:   Line 1:17:  'useEffect' is defined but never used  no-unused-vars
4:31:17 PM:   Line 2:10:  'Container' is defined but never used  no-unused-vars
4:31:17 PM:   Line 2:29:  'Nav' is defined but never used        no-unused-vars
4:31:17 PM:   Line 2:44:  'Button' is defined but never used     no-unused-vars
4:31:17 PM: src/Pages/HowItWorks.js
4:31:17 PM:   Line 6:8:  'NavBar' is defined but never used  no-unused-vars
4:31:17 PM: npm ERR! code ELIFECYCLE
4:31:17 PM: npm ERR! errno 1
4:31:17 PM: npm ERR! webecheckin@0.1.0 build: `react-scripts build`
4:31:17 PM: npm ERR! Exit status 1
4:31:17 PM: npm ERR!
4:31:17 PM: npm ERR! Failed at the webecheckin@0.1.0 build script.
4:31:17 PM: npm ERR! This is probably not a problem with npm. There is likely additional logging output above.
4:31:17 PM: npm ERR! A complete log of this run can be found in:
4:31:17 PM: npm ERR!     /opt/buildhome/.npm/_logs/2021-01-11T00_31_17_429Z-debug.log
4:31:17 PM: ​
4:31:17 PM: ────────────────────────────────────────────────────────────────
4:31:17 PM:   "build.command" failed                                        
4:31:17 PM: ────────────────────────────────────────────────────────────────
4:31:17 PM: ​
4:31:17 PM:   Error message
4:31:17 PM:   Command failed with exit code 1: npm run build

@Mologmedia, you’ll find this article helpful i think:

5:59:42 AM: Build ready to start
5:59:44 AM: build-image version: 53b83b6bede2920f236b25b6f5a95334320dc849
5:59:44 AM: build-image tag: v3.6.0
5:59:44 AM: buildbot version: e26592b49d9d56b21349effe1b8fab4d50845f11
5:59:44 AM: Building without cache
5:59:44 AM: Starting to prepare the repo for build
5:59:44 AM: No cached dependencies found. Cloning fresh repo
5:59:44 AM: git clone https://github.com/Mologmedia/againecheckin1
5:59:46 AM: Preparing Git Reference refs/heads/master
5:59:47 AM: Different publish path detected, going to use the one specified in the Netlify configuration file: ‘build’ versus ‘build/’ in the Netlify UI
5:59:47 AM: Starting build script
5:59:47 AM: Installing dependencies
5:59:47 AM: Python version set to 2.7
5:59:49 AM: v12.18.0 is already installed.
5:59:49 AM: Now using node v12.18.0 (npm v6.14.4)
5:59:50 AM: Started restoring cached build plugins
5:59:50 AM: Finished restoring cached build plugins
5:59:50 AM: Attempting ruby version 2.7.1, read from environment
5:59:51 AM: Using ruby version 2.7.1
5:59:52 AM: Using PHP version 5.6
5:59:52 AM: Started restoring cached node modules
5:59:52 AM: Finished restoring cached node modules
5:59:52 AM: Installing NPM modules using NPM version 6.14.4
6:00:32 AM: > core-js@2.6.12 postinstall /opt/build/repo/node_modules/babel-runtime/node_modules/core-js
6:00:32 AM: > node -e “try{require(’./postinstall’)}catch(e){}”
6:00:32 AM: > core-js@3.8.2 postinstall /opt/build/repo/node_modules/core-js
6:00:32 AM: > node -e “try{require(’./postinstall’)}catch(e){}”
6:00:32 AM: > core-js-pure@3.8.2 postinstall /opt/build/repo/node_modules/core-js-pure
6:00:32 AM: > node -e “try{require(’./postinstall’)}catch(e){}”
6:00:32 AM: > ejs@2.7.4 postinstall /opt/build/repo/node_modules/ejs
6:00:32 AM: > node ./postinstall.js
6:00:36 AM: npm WARN optional SKIPPING OPTIONAL DEPENDENCY: fsevents@1.2.13 (node_modules/webpack-dev-server/node_modules/fsevents):
6:00:36 AM: npm WARN notsup SKIPPING OPTIONAL DEPENDENCY: Unsupported platform for fsevents@1.2.13: wanted {“os”:“darwin”,“arch”:“any”} (current: {“os”:“linux”,“arch”:“x64”})
6:00:36 AM: npm WARN optional SKIPPING OPTIONAL DEPENDENCY: fsevents@1.2.13 (node_modules/watchpack-chokidar2/node_modules/fsevents):
6:00:36 AM: npm WARN notsup SKIPPING OPTIONAL DEPENDENCY: Unsupported platform for fsevents@1.2.13: wanted {“os”:“darwin”,“arch”:“any”} (current: {“os”:“linux”,“arch”:“x64”})
6:00:36 AM: npm WARN optional SKIPPING OPTIONAL DEPENDENCY: fsevents@2.2.1 (node_modules/fsevents):
6:00:36 AM: npm WARN notsup SKIPPING OPTIONAL DEPENDENCY: Unsupported platform for fsevents@2.2.1: wanted {“os”:“darwin”,“arch”:“any”} (current: {“os”:“linux”,“arch”:“x64”})
6:00:36 AM: npm WARN optional SKIPPING OPTIONAL DEPENDENCY: fsevents@2.1.3 (node_modules/chokidar/node_modules/fsevents):
6:00:36 AM: npm WARN notsup SKIPPING OPTIONAL DEPENDENCY: Unsupported platform for fsevents@2.1.3: wanted {“os”:“darwin”,“arch”:“any”} (current: {“os”:“linux”,“arch”:“x64”})
6:00:36 AM: added 1999 packages from 894 contributors and audited 2003 packages in 43.087s
6:00:38 AM: 127 packages are looking for funding
6:00:38 AM: run npm fund for details
6:00:38 AM: found 2 low severity vulnerabilities
6:00:38 AM: run npm audit fix to fix them, or npm audit for details
6:00:38 AM: NPM modules installed
6:00:38 AM: Started restoring cached go cache
6:00:38 AM: Finished restoring cached go cache
6:00:38 AM: go version go1.14.4 linux/amd64
6:00:38 AM: go version go1.14.4 linux/amd64
6:00:38 AM: Installing missing commands
6:00:38 AM: Verify run directory
6:00:40 AM: ​
6:00:40 AM: ────────────────────────────────────────────────────────────────
6:00:40 AM: Netlify Build
6:00:40 AM: ────────────────────────────────────────────────────────────────
6:00:40 AM: ​
6:00:40 AM: ❯ Version
6:00:40 AM: @netlify/build 8.0.1
6:00:40 AM: ​
6:00:40 AM: ❯ Flags
6:00:40 AM: deployId: 5ffb9bf6fce2f3f5d5e9382b
6:00:40 AM: mode: buildbot
6:00:40 AM: ​
6:00:40 AM: ❯ Current directory
6:00:40 AM: /opt/build/repo
6:00:40 AM: ​
6:00:40 AM: ❯ Config file
6:00:40 AM: No config file was defined: using default values.
6:00:40 AM: ​
6:00:40 AM: ❯ Context
6:00:40 AM: production
6:00:41 AM: ​
6:00:41 AM: ────────────────────────────────────────────────────────────────
6:00:41 AM: 1. Build command from Netlify app
6:00:41 AM: ────────────────────────────────────────────────────────────────
6:00:41 AM: ​
6:00:41 AM: $ npm run build
6:00:41 AM: > webecheckin@0.1.0 build /opt/build/repo
6:00:41 AM: > react-scripts build
6:00:43 AM: Creating an optimized production build…
6:01:17 AM:
6:01:17 AM: Treating warnings as errors because process.env.CI = true.
6:01:17 AM: Most CI servers set it automatically.
6:01:17 AM:
6:01:17 AM: Failed to compile.
6:01:17 AM:
6:01:17 AM: src/App.js
6:01:17 AM: Line 4:10: ‘Container’ is defined but never used no-unused-vars
6:01:17 AM: Line 6:50: ‘Link’ is defined but never used no-unused-vars
6:01:17 AM: Line 7:8: ‘createBrowserHistory’ is defined but never used no-unused-vars
6:01:17 AM: src/Components/Home/Carasoul.js
6:01:17 AM: Line 3:21: ‘Row’ is defined but never used no-unused-vars
6:01:17 AM: Line 3:26: ‘Col’ is defined but never used no-unused-vars
6:01:17 AM: Line 6:8: ‘strategy_1’ is defined but never used no-unused-vars
6:01:17 AM: Line 7:8: ‘strategy_2’ is defined but never used no-unused-vars
6:01:17 AM: Line 8:8: ‘strategy_3’ is defined but never used no-unused-vars
6:01:17 AM: Line 9:8: ‘strategy_4’ is defined but never used no-unused-vars
6:01:17 AM: Line 13:8: ‘logo4’ is defined but never used no-unused-vars
6:01:17 AM: Line 71:49: img elements must have an alt prop, either with meaningful text, or an empty string for decorative images jsx-a11y/alt-text
6:01:17 AM: Line 72:49: img elements must have an alt prop, either with meaningful text, or an empty string for decorative images jsx-a11y/alt-text
6:01:17 AM: Line 73:49: img elements must have an alt prop, either with meaningful text, or an empty string for decorative images jsx-a11y/alt-text
6:01:17 AM: src/Components/Home/Cards.js
6:01:17 AM: Line 2:16: ‘Button’ is defined but never used no-unused-vars
6:01:17 AM: src/Components/Home/Footer.js
6:01:17 AM: Line 5:10: ‘IoLocationSharp’ is defined but never used no-unused-vars
6:01:17 AM: Line 5:27: ‘IoCall’ is defined but never used no-unused-vars
6:01:17 AM: Line 46:57: The href attribute is required for an anchor to be keyboard accessible. Provide a valid, navigable address as the href value. If you cannot provide an href, but still need the element to resemble a link, use a button and change it with appropriate styles. Learn more: https://github.com/evcohen/eslint-plugin-jsx-a11y/blob/master/docs/rules/anchor-is-valid.md jsx-a11y/anchor-is-valid
6:01:17 AM: src/Components/Home/Header.js
6:01:17 AM: Line 5:27: ‘Router’ is defined but never used no-unused-vars
6:01:17 AM: Line 5:35: ‘Switch’ is defined but never used no-unused-vars
6:01:17 AM: Line 5:43: ‘Route’ is defined but never used no-unused-vars
6:01:17 AM: src/Components/Home/Navbar.js
6:01:17 AM: Line 1:17: ‘useEffect’ is defined but never used no-unused-vars
6:01:17 AM: Line 2:10: ‘Container’ is defined but never used no-unused-vars
6:01:17 AM: Line 2:44: ‘Button’ is defined but never used no-unused-vars
6:01:17 AM: src/Components/Home/ServicesSection.js
6:01:17 AM: Line 4:8: ‘services_section_bg’ is defined but never used no-unused-vars
6:01:17 AM: Line 31:21: img elements must have an alt prop, either with meaningful text, or an empty string for decorative images jsx-a11y/alt-text
6:01:17 AM: Line 36:7: img elements must have an alt prop, either with meaningful text, or an empty string for decorative images jsx-a11y/alt-text
6:01:17 AM: src/Components/Home/StrategySection.js
6:01:17 AM: Line 8:8: ‘strategy_section_bg’ is defined but never used no-unused-vars
6:01:17 AM: Line 19:29: img elements must have an alt prop, either with meaningful text, or an empty string for decorative images jsx-a11y/alt-text
6:01:17 AM: Line 29:29: img elements must have an alt prop, either with meaningful text, or an empty string for decorative images jsx-a11y/alt-text
6:01:17 AM: Line 39:29: img elements must have an alt prop, either with meaningful text, or an empty string for decorative images jsx-a11y/alt-text
6:01:17 AM: Line 49:29: img elements must have an alt prop, either with meaningful text, or an empty string for decorative images jsx-a11y/alt-text
6:01:17 AM: src/Components/HowItWorks/SecNavbar.js
6:01:17 AM: Line 1:17: ‘useEffect’ is defined but never used no-unused-vars
6:01:17 AM: Line 2:10: ‘Container’ is defined but never used no-unused-vars
6:01:17 AM: Line 2:29: ‘Nav’ is defined but never used no-unused-vars
6:01:17 AM: Line 2:44: ‘Button’ is defined but never used no-unused-vars
6:01:17 AM: src/Pages/HowItWorks.js
6:01:17 AM: Line 6:8: ‘NavBar’ is defined but never used no-unused-vars
6:01:17 AM: npm ERR! code ELIFECYCLE
6:01:17 AM: npm ERR! errno 1
6:01:17 AM: npm ERR! webecheckin@0.1.0 build: react-scripts build
6:01:17 AM: npm ERR! Exit status 1
6:01:17 AM: npm ERR!
6:01:17 AM: npm ERR! Failed at the webecheckin@0.1.0 build script.
6:01:17 AM: npm ERR! This is probably not a problem with npm. There is likely additional logging output above.
6:01:17 AM: npm ERR! A complete log of this run can be found in:
6:01:17 AM: npm ERR! /opt/buildhome/.npm/_logs/2021-01-11T00_31_17_429Z-debug.log
6:01:17 AM: ​
6:01:17 AM: ────────────────────────────────────────────────────────────────
6:01:17 AM: “build.command” failed
6:01:17 AM: ────────────────────────────────────────────────────────────────
6:01:17 AM: ​
6:01:17 AM: Error message
6:01:17 AM: Command failed with exit code 1: npm run build
6:01:17 AM: ​
6:01:17 AM: Error location
6:01:17 AM: In Build command from Netlify app:
6:01:17 AM: npm run build
6:01:17 AM: ​
6:01:17 AM: Resolved config
6:01:17 AM: build:
6:01:17 AM: command: npm run build
6:01:17 AM: commandOrigin: ui
6:01:17 AM: publish: /opt/build/repo/build
6:01:17 AM: Caching artifacts
6:01:17 AM: Started saving node modules
6:01:17 AM: Finished saving node modules
6:01:17 AM: Started saving build plugins
6:01:17 AM: Finished saving build plugins
6:01:17 AM: Started saving pip cache
6:01:17 AM: Finished saving pip cache
6:01:17 AM: Started saving emacs cask dependencies
6:01:17 AM: Finished saving emacs cask dependencies
6:01:17 AM: Started saving maven dependencies
6:01:17 AM: Finished saving maven dependencies
6:01:17 AM: Started saving boot dependencies
6:01:17 AM: Finished saving boot dependencies
6:01:17 AM: Started saving rust rustup cache
6:01:17 AM: Finished saving rust rustup cache
6:01:17 AM: Started saving rust cargo bin cache
6:01:17 AM: Finished saving rust cargo bin cache
6:01:17 AM: Started saving go dependencies
6:01:17 AM: Finished saving go dependencies
6:01:20 AM: Build failed due to a user error: Build script returned non-zero exit code: 2
6:01:20 AM: Failing build: Failed to build site
6:01:20 AM: Failed during stage ‘building site’: Build script returned non-zero exit code: 2
6:01:20 AM: Finished processing build request in 1m36.406593282s

@perry has answered your question just before you posted this. Try that and revert.